BDBM50116659 2-(3,4-Dichloro-phenyl)-N-[(S)-1-(2,5-dihydro-pyrrol-1-ylmethyl)-2-methyl-propyl]-N-methyl-acetamide::CHEMBL75831
SMILES CC(C)[C@@H](CN1CC=CC1)N(C)C(=O)Cc1ccc(Cl)c(Cl)c1
InChI Key InChIKey=QFAIAMMFKKYCTL-QGZVFWFLSA-N
Data  1 KI
  Tab Delimited (TSV)   2D SDfile   Computed 3D by Vconf -m prep SDfile
Find this compound or compounds like it in BindingDB:
Activity Spreadsheet -- Enzyme Inhibition Constant Data from BindingDB
Found 1 hit for monomerid = 50116659
TargetKappa-type opioid receptor(Rattus norvegicus (rat))
Chinese Academy Of Sciences
Curated by ChEMBL
LigandPNGBDBM50116659(2-(3,4-Dichloro-phenyl)-N-[(S)-1-(2,5-dihydro-pyrr...)
Affinity DataKi:  5.70nM. Assay description: Displacement of bound [3H]-diprenorphine in cloned rat Opioid receptor kappa 1 expressed in Sf9 insect cells
In DepthDetails ArticlePubMed