BDBM50116966 1-[2-(4-Methyl-[1,4]diazepan-1-yl)-ethyl]-6-trifluoromethyl-1H-indole::CHEMBL312489
SMILES CN1CCCN(CCn2ccc3ccc(cc23)C(F)(F)F)CC1
InChI Key InChIKey=WMVRLHZMOIYJRE-UHFFFAOYSA-N
Data  1 KI
  Tab Delimited (TSV)   2D SDfile   Computed 3D by Vconf -m prep SDfile
Find this compound or compounds like it in BindingDB:
Activity Spreadsheet -- Enzyme Inhibition Constant Data from BindingDB
Found 1 hit for monomerid = 50116966
Target5-hydroxytryptamine receptor 7(Homo sapiens (Human))
Nps Pharmaceuticals
Curated by ChEMBL
LigandPNGBDBM50116966(1-[2-(4-Methyl-[1,4]diazepan-1-yl)-ethyl]-6-triflu...)
Affinity DataKi:  23nM. Assay description: Binding affinity towards human 5-hydroxytryptamine 7 receptor on HEK293 cells using radioligand [3H]-LSD
In DepthDetails ArticlePubMed