BDBM50117142 CHEMBL3613121
SMILES Nc1nc(SCc2csc(n2)-c2ccc(Cl)cc2)c(C#N)c(-c2ccc3OCOc3c2)c1C#N
InChI Key InChIKey=QNHKNTPLFYZVAI-UHFFFAOYSA-N
Data  1 KI
  Tab Delimited (TSV)   2D SDfile   Computed 3D by Vconf -m prep SDfile
Find this compound or compounds like it in BindingDB:
Activity Spreadsheet -- Enzyme Inhibition Constant Data from BindingDB
Found 1 hit for monomerid = 50117142
TargetAdenosine receptor A1(Homo sapiens (Human))
Leiden University
Curated by ChEMBL
LigandPNGBDBM50117142(CHEMBL3613121)
Affinity DataKi:  4.60nM. Assay description: Displacement of [3H]DPCPX from human adenosine A1 receptor expressed in CHO cell membranes by competition association assay
In DepthDetails ArticlePubMed