BDBM50117166 CHEMBL120976::N*5*-Benzyl-N*5*-methyl-6-(6-morpholin-4-yl-pyridin-3-ylethynyl)-pyrimidine-4,5-diamine
SMILES CN(Cc1ccccc1)c1c(N)ncnc1C#Cc1ccc(nc1)N1CCOCC1
InChI Key InChIKey=PZKFCRKTLSODBO-UHFFFAOYSA-N
Data  2 IC50
  Tab Delimited (TSV)   2D SDfile   Computed 3D by Vconf -m prep SDfile
Find this compound or compounds like it in BindingDB:
Activity Spreadsheet -- Enzyme Inhibition Constant Data from BindingDB
Found 2 hits for monomerid = 50117166
TargetAdenosine kinase(Homo sapiens (Human))
Abbott Laboratories
Curated by ChEMBL
LigandPNGBDBM50117166(CHEMBL120976 | N*5*-Benzyl-N*5*-methyl-6-(6-morpho...)
Affinity DataIC50:  30nM. Assay description: In vitro inhibitory concentration against Adenosine kinase in cycstolic assay
In DepthDetails ArticlePubMed
TargetAdenosine kinase(Rattus norvegicus (rat))
Abbott Laboratories
Curated by ChEMBL
LigandPNGBDBM50117166(CHEMBL120976 | N*5*-Benzyl-N*5*-methyl-6-(6-morpho...)
Affinity DataIC50:  30nM. Assay description: Evaluated in vitro for inhibitory activity against Adenosine kinase (AK)
In DepthDetails ArticlePubMed