BDBM50117307 4-[6-Methoxy-7-(2-pyrrolidin-1-yl-ethoxy)-quinazolin-4-yl]-piperazine-1-carboxylic acid (4-cyano-phenyl)-amide::CHEMBL122572
SMILES COc1cc2c(ncnc2cc1OCCN1CCCC1)N1CCN(CC1)C(=O)Nc1ccc(cc1)C#N
InChI Key InChIKey=FPOSEIRCRZRBMT-UHFFFAOYSA-N
Data  2 IC50
  Tab Delimited (TSV)   2D SDfile   Computed 3D by Vconf -m prep SDfile
Find this compound or compounds like it in BindingDB:
Activity Spreadsheet -- Enzyme Inhibition Constant Data from BindingDB
Found 2 hits for monomerid = 50117307
TargetPlatelet-derived growth factor receptor beta(Homo sapiens (Human))
Millennium Pharmaceuticals
Curated by ChEMBL
LigandPNGBDBM50117307(4-[6-Methoxy-7-(2-pyrrolidin-1-yl-ethoxy)-quinazol...)
Affinity DataIC50:  150nM. Assay description: Inhibition of platelet-derived growth factor receptor beta phosphorylation in MG63 cells in the absence of plasma
In DepthDetails ArticlePubMed
TargetPlatelet-derived growth factor receptor beta(Homo sapiens (Human))
Millennium Pharmaceuticals
Curated by ChEMBL
LigandPNGBDBM50117307(4-[6-Methoxy-7-(2-pyrrolidin-1-yl-ethoxy)-quinazol...)
Affinity DataIC50:  206nM. Assay description: Inhibition of platelet derived growth factor receptor beta phosphorylation in MG63 cells in the presence of human plasma
In DepthDetails ArticlePubMed