BDBM50117428 3-[4-(4-Fluoro-benzyl)-piperidin-1-ylmethyl]-4-[3-(3-methoxy-phenyl)-ureido]-benzoic acid methyl ester::CHEMBL126520
SMILES COC(=O)c1ccc(NC(=O)Nc2cccc(OC)c2)c(CN2CCC(Cc3ccc(F)cc3)CC2)c1
InChI Key InChIKey=AZNIXHOAQCCYOH-UHFFFAOYSA-N
Data  1 IC50
  Tab Delimited (TSV)   2D SDfile   Computed 3D by Vconf -m prep SDfile
Find this compound or compounds like it in BindingDB:
Activity Spreadsheet -- Enzyme Inhibition Constant Data from BindingDB
Found 1 hit for monomerid = 50117428
TargetC-C chemokine receptor type 3(Homo sapiens (Human))
Bristol-Myers Squibb
Curated by ChEMBL
LigandPNGBDBM50117428(3-[4-(4-Fluoro-benzyl)-piperidin-1-ylmethyl]-4-[3-...)
Affinity DataIC50:  64nM. Assay description: Inhibitory activity against recombinant human Chemokine receptor type 3 (CCR3) expressed in chinese hamster ovary cells
In DepthDetails ArticlePubMed