BDBM50117498 CHEMBL415127::H-His-Ser-Lys-Arg-Arg-Leu-Ile-(D)-Pse-OH
SMILES CC[C@H](C)[C@H](NC(=O)[C@H](CC(C)C)NC(=O)[C@H](CCCNC(N)=N)NC(=O)[C@H](CCCNC(N)=N)NC(=O)[C@H](CCCCN)NC(=O)[C@H](CO)NC(=O)[C@@H](N)Cc1cnc[nH]1)C(=O)N[C@H]([C@@H](O)c1ccccc1)C(O)=O
InChI Key InChIKey=KXPGGPTUGKPQLH-WKIOQTRBSA-N
Data  1 IC50
  Tab Delimited (TSV)   2D SDfile   Computed 3D by Vconf -m prep SDfile
Find this compound or compounds like it in BindingDB:
Activity Spreadsheet -- Enzyme Inhibition Constant Data from BindingDB
Found 1 hit for monomerid = 50117498
TargetCyclin-A1/Cyclin-A2/Cyclin-dependent kinase 2(Homo sapiens (Human))
University Of Nottingham
Curated by ChEMBL
LigandPNGBDBM50117498(CHEMBL415127 | H-His-Ser-Lys-Arg-Arg-Leu-Ile-(D)-P...)
Affinity DataIC50:  1.20E+3nM. Assay description: In vitro inhibition of CDK2-cyclin A kinase activity on retinoblastoma protein
In DepthDetails ArticlePubMed