BDBM50117567 (3aR,9bS)-6,7-Difluoro-2,3,3a,9b-tetrahydro-1H-cyclopenta[c]quinolin-4-ylamine::6,7-Difluoro-2,3,3a,9b-tetrahydro-1H-cyclopenta[c]quinolin-4-ylamine::CHEMBL86961
SMILES NC1=Nc2c(F)c(F)ccc2[C@H]2CCC[C@@H]12
InChI Key InChIKey=CXBOTECYGADDIW-HTRCEHHLSA-N
Data  6 IC50
  Tab Delimited (TSV)   2D SDfile   Computed 3D by Vconf -m prep SDfile
Find this compound or compounds like it in BindingDB:
Activity Spreadsheet -- Enzyme Inhibition Constant Data from BindingDB
Found 6 hits for monomerid = 50117567
TargetNitric oxide synthase, endothelial(Homo sapiens (Human))
Schering
Curated by ChEMBL
LigandPNGBDBM50117567((3aR,9bS)-6,7-Difluoro-2,3,3a,9b-tetrahydro-1H-cyc...)
Affinity DataIC50:  2.00E+4nM. Assay description: In vitro inhibition of endothelial nitric oxide synthase.
In DepthDetails ArticlePubMed
TargetNitric oxide synthase, inducible(Homo sapiens (Human))
Schering
Curated by ChEMBL
LigandPNGBDBM50117567((3aR,9bS)-6,7-Difluoro-2,3,3a,9b-tetrahydro-1H-cyc...)
Affinity DataIC50:  5.10E+3nM. Assay description: In vitro inhibition of inducible nitric oxide synthase.
In DepthDetails ArticlePubMed
TargetNitric oxide synthase, brain(Homo sapiens (Human))
Schering
Curated by ChEMBL
LigandPNGBDBM50117567((3aR,9bS)-6,7-Difluoro-2,3,3a,9b-tetrahydro-1H-cyc...)
Affinity DataIC50:  680nM. Assay description: Inhibition of human neuronal nitric oxide synthase
In DepthDetails ArticlePubMed
TargetNitric oxide synthase, inducible(Homo sapiens (Human))
Schering
Curated by ChEMBL
LigandPNGBDBM50117567((3aR,9bS)-6,7-Difluoro-2,3,3a,9b-tetrahydro-1H-cyc...)
Affinity DataIC50:  5.10E+3nM. Assay description: Inhibition of human inducible nitric oxide synthase
In DepthDetails ArticlePubMed
TargetNitric oxide synthase, endothelial(Homo sapiens (Human))
Schering
Curated by ChEMBL
LigandPNGBDBM50117567((3aR,9bS)-6,7-Difluoro-2,3,3a,9b-tetrahydro-1H-cyc...)
Affinity DataIC50:  2.00E+4nM. Assay description: Inhibition of human endothelial nitric oxide synthase
In DepthDetails ArticlePubMed
TargetNitric oxide synthase, brain(Homo sapiens (Human))
Schering
Curated by ChEMBL
LigandPNGBDBM50117567((3aR,9bS)-6,7-Difluoro-2,3,3a,9b-tetrahydro-1H-cyc...)
Affinity DataIC50:  680nM. Assay description: Concentration required to inhibit neuronal nitric oxide synthase
In DepthDetails ArticlePubMed