BDBM50117587 1-Benzyl-4-(5,6-dimethoxy-1-oxo-indan-2-ylidenemethyl)-pyridinium::CHEMBL86863
SMILES COc1cc2C\C(=C/c3cc[n+](Cc4ccccc4)cc3)C(=O)c2cc1OC
InChI Key InChIKey=UCJOMTSRQPQWLO-UDWIEESQSA-N
Data  2 IC50  1 EC50
  Tab Delimited (TSV)   2D SDfile   Computed 3D by Vconf -m prep SDfile
Find this compound or compounds like it in BindingDB:
Activity Spreadsheet -- Enzyme Inhibition Constant Data from BindingDB
Found 3 hits for monomerid = 50117587
TargetAcetylcholinesterase(Homo sapiens (Human))
Organon Laboratories
Curated by ChEMBL
LigandPNGBDBM50117587(1-Benzyl-4-(5,6-dimethoxy-1-oxo-indan-2-ylidenemet...)
Affinity DataEC50:  12nM. Assay description: In vitro reversal of vecuronium-induced neuromuscular block in guinea pig hemi-diaphragm.
In DepthDetails ArticlePubMed
TargetAcetylcholinesterase(Electrophorus electricus (Electric eel))
Shanghai University Of Traditional Chinese Medicine
Curated by ChEMBL
LigandPNGBDBM50117587(1-Benzyl-4-(5,6-dimethoxy-1-oxo-indan-2-ylidenemet...)
Affinity DataIC50:  2.90nM. Assay description: Inhibition of electric eel AChE using acetylthiocholine iodide as substrate pretreated for 6 mins followed by substrate addition measured up to 180 s...
In DepthDetails ArticlePubMed
TargetAcetylcholinesterase(Homo sapiens (Human))
Organon Laboratories
Curated by ChEMBL
LigandPNGBDBM50117587(1-Benzyl-4-(5,6-dimethoxy-1-oxo-indan-2-ylidenemet...)
Affinity DataIC50:  3.40nM. Assay description: Inhibition of human erythrocyte AChE using acetylthiocholine iodide as substrate pretreated for 6 mins followed by substrate addition measured up to ...
In DepthDetails ArticlePubMed