BDBM50117655 CHEMBL3613691
SMILES CN(C)c1ccc(\C=C\C(=O)c2ccc3ncc(C(N)=O)c(Nc4ccc(Cl)cc4)c3c2)cc1
InChI Key InChIKey=JMDDILOQKYWRNN-LHHJGKSTSA-N
Data  1 IC50
  Tab Delimited (TSV)   2D SDfile   Computed 3D by Vconf -m prep SDfile
Find this compound or compounds like it in BindingDB:
Activity Spreadsheet -- Enzyme Inhibition Constant Data from BindingDB
Found 1 hit for monomerid = 50117655
TargetEpidermal growth factor receptor(Homo sapiens (Human))
Jazan University
Curated by ChEMBL
LigandPNGBDBM50117655(CHEMBL3613691)
Affinity DataIC50:  5.28E+3nM. Assay description: Inhibition of epidermal growth factor receptor kinase (unknown origin) using [33P]-ATP after 20 to 30 mins by radiometric assay
In DepthDetails ArticlePubMed