BDBM50117680 CHEMBL3613792
SMILES NC(=N)c1ccc(cc1)C1C2C(C3CCCN13)C(=O)N(Cc1ccc(F)cc1)C2=O
InChI Key InChIKey=GJYCQHGTXMVIBG-UHFFFAOYSA-N
Data  1 KI
  Tab Delimited (TSV)   2D SDfile   Computed 3D by Vconf -m prep SDfile
Find this compound or compounds like it in BindingDB:
Activity Spreadsheet -- Enzyme Inhibition Constant Data from BindingDB
Found 1 hit for monomerid = 50117680
TargetProthrombin(Homo sapiens (Human))
University Of Michigan
Curated by ChEMBL
LigandPNGBDBM50117680(CHEMBL3613792)
Affinity DataKi:  57nM. Assay description: Inhibition of thrombin (unknown origin)
In DepthDetails ArticlePubMed