BDBM50117944 CHEMBL3612613
SMILES Fc1cccc(\C=C\CSSC\C=C\c2cccc(F)c2)c1
InChI Key InChIKey=HJJQEMWWLBZXAO-UHFFFAOYSA-N
Data  2 IC50
  Tab Delimited (TSV)   2D SDfile   Computed 3D by Vconf -m prep SDfile
Find this compound or compounds like it in BindingDB:
Activity Spreadsheet -- Enzyme Inhibition Constant Data from BindingDB
Found 2 hits for monomerid = 50117944
TargetCholinesterase(Equus caballus (Horse))
University Of Delhi
Curated by ChEMBL
LigandPNGBDBM50117944(CHEMBL3612613)
Affinity DataIC50: >1.00E+5nM. Assay description: Inhibition of equine serum BuChE using DTNB as substrate incubated for 5 mins prior to substrate addition measured after 2 mins by Ellman's method
In DepthDetails ArticlePubMed
TargetAcetylcholinesterase(Electrophorus electricus (Electric eel))
University Of Delhi
Curated by ChEMBL
LigandPNGBDBM50117944(CHEMBL3612613)
Affinity DataIC50:  5.32E+4nM. Assay description: Inhibition of electric eel AChE using DTNB as substrate incubated for 5 mins prior to substrate addition measured after 2 mins by Ellman's method
In DepthDetails ArticlePubMed