BDBM50117976 CHEMBL3612835
SMILES COc1ccc2cc(ccc2c1)C(=O)NCCCN1CCC(Cc2ccccc2)CC1
InChI Key InChIKey=WKQJQIBZGUGCDW-UHFFFAOYSA-N
Data  2 IC50
  Tab Delimited (TSV)   2D SDfile   Computed 3D by Vconf -m prep SDfile
Find this compound or compounds like it in BindingDB:
Activity Spreadsheet -- Enzyme Inhibition Constant Data from BindingDB
Found 2 hits for monomerid = 50117976
TargetSodium-dependent noradrenaline transporter(Homo sapiens (Human))
Chonnam National University
Curated by ChEMBL
LigandPNGBDBM50117976(CHEMBL3612835)
Affinity DataIC50:  238nM. Assay description: Inhibition of human NET expressed in HEK293 cells assessed as reduction of serotonin reuptake using [3H]-NET after 15 mins by liquid scintillation co...
In DepthDetails ArticlePubMed
TargetSodium-dependent serotonin transporter(Homo sapiens (Human))
Chonnam National University
Curated by ChEMBL
LigandPNGBDBM50117976(CHEMBL3612835)
Affinity DataIC50:  323nM. Assay description: Inhibition of human SERT expressed in HEK293 cells assessed as reduction of serotonin reuptake using [3H]-SERT after 15 mins by liquid scintillation ...
In DepthDetails ArticlePubMed