BDBM50118017 CHEMBL3613407
SMILES Cc1ccc(cc1)C(=O)Oc1ccc(O)c(c1)C(C)(C)C
InChI Key InChIKey=KJDHIZITJXZCHR-UHFFFAOYSA-N
Data  1 IC50
  Tab Delimited (TSV)   2D SDfile   Computed 3D by Vconf -m prep SDfile
Find this compound or compounds like it in BindingDB:
Activity Spreadsheet -- Enzyme Inhibition Constant Data from BindingDB
Found 1 hit for monomerid = 50118017
TargetBile acid receptor(Homo sapiens (Human))
East China University Of Science And Technology
Curated by ChEMBL
LigandPNGBDBM50118017(CHEMBL3613407)
Affinity DataIC50: >1.00E+5nM. Assay description: Antagonist activity at GST-tagged FXR LBD (unknown origin) assessed as inhibition of CDCA-induced Bio-SRC-1 recruitment after 30 mins by HTRF assay
In DepthDetails ArticlePubMed