BDBM50118172 CHEMBL3613668
SMILES COc1nn(Cc2cccc(c2)C(F)(F)F)c(=O)o1
InChI Key InChIKey=CGKWLHNTAWLNMM-UHFFFAOYSA-N
Data  2 IC50
  Tab Delimited (TSV)   2D SDfile   Computed 3D by Vconf -m prep SDfile
Find this compound or compounds like it in BindingDB:
Activity Spreadsheet -- Enzyme Inhibition Constant Data from BindingDB
Found 2 hits for monomerid = 50118172
TargetMonoacylglycerol lipase ABHD6(Homo sapiens (Human))
University Of Eastern Finland
Curated by ChEMBL
LigandPNGBDBM50118172(CHEMBL3613668)
Affinity DataIC50:  870nM. Assay description: Inhibition of human ABHD6 expressed in HEK293 cells assessed as reduction in glycerol production from 1-AG hydrolysis pre-incubated for 30 mins befor...
In DepthDetails ArticlePubMed
TargetMonoacylglycerol lipase ABHD6(Homo sapiens (Human))
University Of Eastern Finland
Curated by ChEMBL
LigandPNGBDBM50118172(CHEMBL3613668)
Affinity DataIC50:  870nM. Assay description: Inhibition of human ABHD6 expressed in HEK293 cells assessed as reduction in glycerol production from 1-AG hydrolysis pre-incubated for 30 mins befor...
In DepthDetails ArticlePubMed