BDBM50118379 CHEMBL3613195
SMILES CNS(=O)(=O)c1ccc(N(C)C)c(Nc2ncnc3[nH]ccc23)c1
InChI Key InChIKey=FRRDBCZMMUBGNF-UHFFFAOYSA-N
Data  10 IC50
  Tab Delimited (TSV)   2D SDfile   Computed 3D by Vconf -m prep SDfile
Find this compound or compounds like it in BindingDB:
Activity Spreadsheet -- Enzyme Inhibition Constant Data from BindingDB
Found 10 hits for monomerid = 50118379
TargetSerine/threonine-protein kinase TNNI3K(Homo sapiens (Human))
Glaxosmithkline
Curated by ChEMBL
LigandPNGBDBM50118379(CHEMBL3613195)
Affinity DataIC50:  50nM. Assay description: Inhibition of human myc-tagged TNNI3K autophosphorylation overexpressed in HEKMSRII cells preincubated for 30 mins followed by pervanadate solution a...
In DepthDetails ArticlePubMed
TargetSerine/threonine-protein kinase TNNI3K(Homo sapiens (Human))
Glaxosmithkline
Curated by ChEMBL
LigandPNGBDBM50118379(CHEMBL3613195)
Affinity DataIC50:  50nM. Assay description: Displacement of 5-({[2-({[3-({4-[(5-hydroxy-2-methylphenyl)amino]-2-pyrimidinyl}amino)phenyl]carbonyl}amino)-ethyl]amino}carbonyl)-2-(6-hydroxy-3-oxo...
In DepthDetails ArticlePubMed
TargetSerine/threonine-protein kinase B-raf(Homo sapiens (Human))
Glaxosmithkline
Curated by ChEMBL
LigandPNGBDBM50118379(CHEMBL3613195)
Affinity DataIC50:  6nM. Assay description: Inhibition of His6-tagged full length BRAF V600E mutant (2 to 766 residues) (unknown origin) expressed in Baculovirus expression system by BRAMA meth...
In DepthDetails ArticlePubMed
TargetSerine/threonine-protein kinase TNNI3K(Homo sapiens (Human))
Glaxosmithkline
Curated by ChEMBL
LigandPNGBDBM50118379(CHEMBL3613195)
Affinity DataIC50:  50nM. Assay description: Inhibition of human myc-tagged TNNI3K autophosphorylation overexpressed in HEKMSR2 cells incubated for 30 mins by time resolved fluorescence assay
In DepthDetails ArticlePubMed
TargetSerine/threonine-protein kinase B-raf(Homo sapiens (Human))
Glaxosmithkline
Curated by ChEMBL
LigandPNGBDBM50118379(CHEMBL3613195)
Affinity DataIC50:  6nM. Assay description: Inhibition of B-Raf (unknown origin)
In DepthDetails ArticlePubMed
TargetSerine/threonine-protein kinase B-raf(Homo sapiens (Human))
Glaxosmithkline
Curated by ChEMBL
LigandPNGBDBM50118379(CHEMBL3613195)
Affinity DataIC50:  6nM. Assay description: Inhibition of full-length His6-tagged BRAF V600E mutant (2 to 766 residues) (unknown origin) expressed in baculovirus system by B-Raf accelerated MEK...
In DepthDetails ArticlePubMed
TargetSerine/threonine-protein kinase TNNI3K(Homo sapiens (Human))
Glaxosmithkline
Curated by ChEMBL
LigandPNGBDBM50118379(CHEMBL3613195)
Affinity DataIC50:  50nM. Assay description: Displacement of 5-({[2-({[3-({4-[(5-hydroxy-2-methylphenyl)amino]-2-pyrimidinyl}amino)phenyl]carbonyl}amino)-ethyl]amino}carbonyl)-2-(6-hydroxy-3-oxo...
In DepthDetails ArticlePubMed
TargetSerine/threonine-protein kinase TNNI3K(Homo sapiens (Human))
Glaxosmithkline
Curated by ChEMBL
LigandPNGBDBM50118379(CHEMBL3613195)
Affinity DataIC50:  50nM. Assay description: Inhibition of TNNI3K (unknown origin)
In DepthDetails ArticlePubMed
TargetSerine/threonine-protein kinase TNNI3K(Homo sapiens (Human))
Glaxosmithkline
Curated by ChEMBL
LigandPNGBDBM50118379(CHEMBL3613195)
Affinity DataIC50:  50nM. Assay description: Inhibition of human myc-TNNI3K expressed in HEK-MSR2 cells assessed as reduction in TNNI3K autophosphorylation preincubated for 30 mins followed by p...
In DepthDetails ArticlePubMed
TargetSerine/threonine-protein kinase TNNI3K(Homo sapiens (Human))
Glaxosmithkline
Curated by ChEMBL
LigandPNGBDBM50118379(CHEMBL3613195)
Affinity DataIC50:  50nM. Assay description: Displacement of 5-({[2-({[3-({4-[(5-hydroxy-2-methylphenyl)amino]-2-pyrimidinyl}amino)phenyl]carbonyl}amino)-ethyl]amino}carbonyl)-2-(6-hydroxy-3-oxo...
In DepthDetails ArticlePubMed