BDBM50118408 CHEMBL3612658
SMILES CNS(=O)(=O)c1cccc(c1)N(C)c1ncnc2[nH]ccc12
InChI Key InChIKey=XMSMWFUSNUFHEB-UHFFFAOYSA-N
Data  1 IC50
  Tab Delimited (TSV)   2D SDfile   Computed 3D by Vconf -m prep SDfile
Find this compound or compounds like it in BindingDB:
Activity Spreadsheet -- Enzyme Inhibition Constant Data from BindingDB
Found 1 hit for monomerid = 50118408
TargetSerine/threonine-protein kinase TNNI3K(Homo sapiens (Human))
Glaxosmithkline
Curated by ChEMBL
LigandPNGBDBM50118408(CHEMBL3612658)
Affinity DataIC50:  5.00E+3nM. Assay description: Displacement of 5-({[2-({[3-({4-[(5-hydroxy-2-methylphenyl)amino]-2-pyrimidinyl}amino)phenyl]carbonyl}amino)-ethyl]amino}carbonyl)-2-(6-hydroxy-3-oxo...
In DepthDetails ArticlePubMed