BDBM50118498 5-Methyl-1-(4-trityloxy-but-2-ynyl)-1H-pyrimidine-2,4-dione::CHEMBL136020
SMILES Cc1cn(CC#CCOC(c2ccccc2)(c2ccccc2)c2ccccc2)c(=O)[nH]c1=O
InChI Key InChIKey=WBYYLLQKBJNNSY-UHFFFAOYSA-N
Data  1 IC50
  Tab Delimited (TSV)   2D SDfile   Computed 3D by Vconf -m prep SDfile
Find this compound or compounds like it in BindingDB:
Activity Spreadsheet -- Enzyme Inhibition Constant Data from BindingDB
Found 1 hit for monomerid = 50118498
TargetThymidine kinase, cytosolic(Homo sapiens (Human))
Instituto De Qu£Mica M£Dica (Csic)
Curated by ChEMBL
LigandPNGBDBM50118498(5-Methyl-1-(4-trityloxy-but-2-ynyl)-1H-pyrimidine-...)
Affinity DataIC50:  3.10E+3nM. Assay description: Compound was evaluated for inhibitory effect against phosphorylation of [methyl-3H]dThd by HSV-1 Thymidine kinase
In DepthDetails ArticlePubMed