BDBM50118573 CHEMBL435988::Sulfamic acid 4-oxo-2-(4-pentyl-bicyclo[2.2.2]oct-1-yl)-4H-chromen-6-yl ester
SMILES CCCCCC12CCC(CC1)(CC2)c1cc(=O)c2cc(OS(N)(=O)=O)ccc2o1
InChI Key InChIKey=MFLSJNGKHBHZDJ-UHFFFAOYSA-N
Data  1 IC50
  Tab Delimited (TSV)   2D SDfile   Computed 3D by Vconf -m prep SDfile
Find this compound or compounds like it in BindingDB:
Activity Spreadsheet -- Enzyme Inhibition Constant Data from BindingDB
Found 1 hit for monomerid = 50118573
TargetSteryl-sulfatase(Homo sapiens (Human))
Novartis Research Institute Vienna
Curated by ChEMBL
LigandPNGBDBM50118573(CHEMBL435988 | Sulfamic acid 4-oxo-2-(4-pentyl-bic...)
Affinity DataIC50:  11nM. Assay description: Inhibitory activity against purified human steroid sulfatase (STS)
In DepthDetails ArticlePubMed