BDBM50118675 Isopaucifloral F
SMILES Oc1ccc(cc1)[C@H]1[C@@H](C(=O)c2cc(O)cc(O)c12)c1cc(O)cc(O)c1
InChI Key InChIKey=RXCCNNFHGNTSJG-OALUTQOASA-N
Data  1 EC50
  Tab Delimited (TSV)   2D SDfile   Computed 3D by Vconf -m prep SDfile
Find this compound or compounds like it in BindingDB:
Activity Spreadsheet -- Enzyme Inhibition Constant Data from BindingDB
Found 1 hit for monomerid = 50118675
TargetEstrogen receptor beta(Homo sapiens (Human))
Fudan University
Curated by ChEMBL
LigandPNGBDBM50118675(Isopaucifloral F)
Affinity DataEC50:  4.70E+4nM. Assay description: Agonist activity at ERbeta (248 to 510 amino acid residues) (unknown origin) assessed as induction of interaction with SRC1 after 24 hrs by yeast two...
In DepthDetails ArticlePubMed