BDBM50118819 CHEMBL3617370
SMILES Fc1ccccc1NC(=O)Nc1nc(cs1)-c1cc2ccccc2o1
InChI Key InChIKey=MRLWHCZAIPEILV-UHFFFAOYSA-N
Data  2 IC50
  Tab Delimited (TSV)   2D SDfile   Computed 3D by Vconf -m prep SDfile
Find this compound or compounds like it in BindingDB:
Activity Spreadsheet -- Enzyme Inhibition Constant Data from BindingDB
Found 2 hits for monomerid = 50118819
TargetCholinesterase(Equus caballus (Horse))
Bezmialem Vakif University
Curated by ChEMBL
LigandPNGBDBM50118819(CHEMBL3617370)
Affinity DataIC50:  4.17E+4nM. Assay description: Inhibition of horse serum butyrylcholinesterase using butyrylthiocholine iodide as substrate preincubated for 15 mins followed by substrate addition ...
In DepthDetails ArticlePubMed
TargetAcetylcholinesterase(Electrophorus electricus (Electric eel))
Bezmialem Vakif University
Curated by ChEMBL
LigandPNGBDBM50118819(CHEMBL3617370)
Affinity DataIC50:  3.09E+4nM. Assay description: Inhibition of electric eel acetylcholinesterase using acetylthiocholine iodide as substrate preincubated for 15 mins followed by substrate addition b...
In DepthDetails ArticlePubMed