BDBM50118918 CHEMBL139770::{2-[2-(Pyrrolidine-1-carbonyl)-pyrrolidine-1-carbonyl]-phenyl}-[2-(pyrrolidine-1-carbonyl)-pyrrolidin-1-yl]-methanone
SMILES O=C(C1CCCN1C(=O)c1ccccc1C(=O)N1CCC[C@H]1C(=O)N1CCCC1)N1CCCC1
InChI Key InChIKey=HQDSTBZJFIXHNG-HMTLIYDFSA-N
Data  1 IC50
  Tab Delimited (TSV)   2D SDfile   Computed 3D by Vconf -m prep SDfile
Find this compound or compounds like it in BindingDB:
Activity Spreadsheet -- Enzyme Inhibition Constant Data from BindingDB
Found 1 hit for monomerid = 50118918
TargetProlyl endopeptidase(Sus scrofa)
University Of Kuopio
Curated by ChEMBL
LigandPNGBDBM50118918(CHEMBL139770 | {2-[2-(Pyrrolidine-1-carbonyl)-pyrr...)
Affinity DataIC50:  2.10E+4nM. Assay description: In vitro inhibitory activity of the compound against prolyl oligopeptidase (POP) from pig brain ;value ranges from (7800-54000)
In DepthDetails ArticlePubMed