BDBM50118933 (S)-2,3-Diamino-1-piperidin-1-yl-propan-1-one::CHEMBL317537
SMILES NC[C@H](N)C(=O)N1CCCCC1
InChI Key InChIKey=JVCNLFFNIXVBAD-ZETCQYMHSA-N
Data  2 IC50
  Tab Delimited (TSV)   2D SDfile   Computed 3D by Vconf -m prep SDfile
Find this compound or compounds like it in BindingDB:
Activity Spreadsheet -- Enzyme Inhibition Constant Data from BindingDB
Found 2 hits for monomerid = 50118933
TargetDipeptidyl peptidase 4(Homo sapiens (Human))
University Of Antwerp (Uia)
Curated by ChEMBL
LigandPNGBDBM50118933((S)-2,3-Diamino-1-piperidin-1-yl-propan-1-one | CH...)
Affinity DataIC50: >1.00E+6nM. Assay description: In vitro inhibition of human Dipeptidylpeptidase IV.
In DepthDetails ArticlePubMed
TargetDipeptidyl peptidase 2(Homo sapiens (Human))
University Of Antwerp (Uia)
Curated by ChEMBL
LigandPNGBDBM50118933((S)-2,3-Diamino-1-piperidin-1-yl-propan-1-one | CH...)
Affinity DataIC50:  1.84E+3nM. Assay description: In vitro inhibition of porcine Dipeptidylpeptidase II.
In DepthDetails ArticlePubMed