BDBM50118940 (S)-1-((S)-2-Amino-propionyl)-pyrrolidine-2-carbonitrile::CHEMBL319514
SMILES C[C@H](N)C(=O)N1CCC[C@H]1C#N
InChI Key InChIKey=WOTYLOGRWSPPGZ-BQBZGAKWSA-N
Data  1 KI  3 IC50
  Tab Delimited (TSV)   2D SDfile   Computed 3D by Vconf -m prep SDfile
Find this compound or compounds like it in BindingDB:
Activity Spreadsheet -- Enzyme Inhibition Constant Data from BindingDB
Found 4 hits for monomerid = 50118940
TargetDipeptidyl peptidase 4(Homo sapiens (Human))
University Of Antwerp (Uia)
Curated by ChEMBL
LigandPNGBDBM50118940((S)-1-((S)-2-Amino-propionyl)-pyrrolidine-2-carbon...)
Affinity DataKi:  200nM. Assay description: Inhibition of Dipeptidyl Peptidase IV
In DepthDetails ArticlePubMed
TargetDipeptidyl peptidase 2(Homo sapiens (Human))
University Of Antwerp (Uia)
Curated by ChEMBL
LigandPNGBDBM50118940((S)-1-((S)-2-Amino-propionyl)-pyrrolidine-2-carbon...)
Affinity DataIC50:  1.10E+5nM. Assay description: Inhibitory activity of compound against Dipeptidylpeptidase II (DPP II)
In DepthDetails ArticlePubMed
TargetDipeptidyl peptidase 4(Homo sapiens (Human))
University Of Antwerp (Uia)
Curated by ChEMBL
LigandPNGBDBM50118940((S)-1-((S)-2-Amino-propionyl)-pyrrolidine-2-carbon...)
Affinity DataIC50:  200nM. Assay description: Inhibitory activity against Dipeptidylpeptidase IV (DPP IV)
In DepthDetails ArticlePubMed
TargetDipeptidyl peptidase 2(Homo sapiens (Human))
University Of Antwerp (Uia)
Curated by ChEMBL
LigandPNGBDBM50118940((S)-1-((S)-2-Amino-propionyl)-pyrrolidine-2-carbon...)
Affinity DataIC50:  1.10E+5nM. Assay description: Inhibitory activity against Dipeptidyl Peptidase II
In DepthDetails ArticlePubMed