BDBM50118942 2-Amino-3-(1H-imidazol-4-yl)-1-pyrrolidin-1-yl-propan-1-one::CHEMBL317944
SMILES NC(Cc1cnc[nH]1)C(=O)N1CCCC1
InChI Key InChIKey=TVLAAZVYMRMYSE-UHFFFAOYSA-N
Data  4 IC50
  Tab Delimited (TSV)   2D SDfile   Computed 3D by Vconf -m prep SDfile
Find this compound or compounds like it in BindingDB:
Activity Spreadsheet -- Enzyme Inhibition Constant Data from BindingDB
Found 4 hits for monomerid = 50118942
TargetDipeptidyl peptidase 2(Homo sapiens (Human))
University Of Antwerp (Uia)
Curated by ChEMBL
LigandPNGBDBM50118942(2-Amino-3-(1H-imidazol-4-yl)-1-pyrrolidin-1-yl-pro...)
Affinity DataIC50:  1.16E+3nM. Assay description: In vitro inhibition of porcine Dipeptidylpeptidase II.
In DepthDetails ArticlePubMed
TargetDipeptidyl peptidase 2(Homo sapiens (Human))
University Of Antwerp (Uia)
Curated by ChEMBL
LigandPNGBDBM50118942(2-Amino-3-(1H-imidazol-4-yl)-1-pyrrolidin-1-yl-pro...)
Affinity DataIC50:  1.20E+3nM. Assay description: Inhibitory activity of compound against Dipeptidylpeptidase II (DPP II)
In DepthDetails ArticlePubMed
TargetDipeptidyl peptidase 4(Homo sapiens (Human))
University Of Antwerp (Uia)
Curated by ChEMBL
LigandPNGBDBM50118942(2-Amino-3-(1H-imidazol-4-yl)-1-pyrrolidin-1-yl-pro...)
Affinity DataIC50:  2.31E+4nM. Assay description: Inhibitory activity against Dipeptidylpeptidase IV (DPP IV)
In DepthDetails ArticlePubMed
TargetDipeptidyl peptidase 4(Homo sapiens (Human))
University Of Antwerp (Uia)
Curated by ChEMBL
LigandPNGBDBM50118942(2-Amino-3-(1H-imidazol-4-yl)-1-pyrrolidin-1-yl-pro...)
Affinity DataIC50:  2.32E+4nM. Assay description: In vitro inhibition of human Dipeptidylpeptidase IV.
In DepthDetails ArticlePubMed