BDBM50118944 CHEMBL273579::Pyrrolidin-2-yl-pyrrolidin-1-yl-methanone
SMILES O=C(C1CCCN1)N1CCCC1
InChI Key InChIKey=HDLWINONZUFKQV-UHFFFAOYSA-N
Data  2 IC50
  Tab Delimited (TSV)   2D SDfile   Computed 3D by Vconf -m prep SDfile
Find this compound or compounds like it in BindingDB:
Activity Spreadsheet -- Enzyme Inhibition Constant Data from BindingDB
Found 2 hits for monomerid = 50118944
TargetDipeptidyl peptidase 2(Homo sapiens (Human))
University Of Antwerp (Uia)
Curated by ChEMBL
LigandPNGBDBM50118944(CHEMBL273579 | Pyrrolidin-2-yl-pyrrolidin-1-yl-met...)
Affinity DataIC50: >5.00E+5nM. Assay description: Inhibitory activity of compound against Dipeptidylpeptidase II (DPP II)
In DepthDetails ArticlePubMed
TargetDipeptidyl peptidase 4(Homo sapiens (Human))
University Of Antwerp (Uia)
Curated by ChEMBL
LigandPNGBDBM50118944(CHEMBL273579 | Pyrrolidin-2-yl-pyrrolidin-1-yl-met...)
Affinity DataIC50:  1.50E+4nM. Assay description: Inhibitory activity against Dipeptidylpeptidase IV (DPP IV)
In DepthDetails ArticlePubMed