BDBM50119001 (2,4-Dimethyl-phenyl)-[6-hydroxy-3-(2-methoxy-benzyl)-benzofuran-2-yl]-methanone::CHEMBL319765
SMILES COc1ccccc1Cc1c(oc2cc(O)ccc12)C(=O)c1ccc(C)cc1C
InChI Key InChIKey=SMBUBSGAYWTILQ-UHFFFAOYSA-N
Data  2 IC50
  Tab Delimited (TSV)   2D SDfile   Computed 3D by Vconf -m prep SDfile
Find this compound or compounds like it in BindingDB:
Activity Spreadsheet -- Enzyme Inhibition Constant Data from BindingDB
Found 2 hits for monomerid = 50119001
TargetEstrogen receptor beta(Rattus norvegicus)
Bayer Research Center
Curated by ChEMBL
LigandPNGBDBM50119001((2,4-Dimethyl-phenyl)-[6-hydroxy-3-(2-methoxy-benz...)
Affinity DataIC50:  830nM. Assay description: Binding to Estrogen receptor- beta (ER beta) receptor
In DepthDetails ArticlePubMed
TargetEstrogen receptor(RAT)
Bayer Research Center
Curated by ChEMBL
LigandPNGBDBM50119001((2,4-Dimethyl-phenyl)-[6-hydroxy-3-(2-methoxy-benz...)
Affinity DataIC50:  380nM. Assay description: Binding to Estrogen receptor- alpha (ER alpha) receptor
In DepthDetails ArticlePubMed