BDBM50119164 ({1-[6-Amino-9-((2R,3R,4S,5R)-3,4-dihydroxy-5-hydroxymethyl-tetrahydro-furan-2-yl)-9H-purin-2-yl]-1H-pyrazole-4-carbonyl}-amino)-acetic acid ethyl ester::CHEMBL318732
SMILES CCOC(=O)CNC(=O)c1cnn(c1)-c1nc(N)c2ncn([C@@H]3O[C@H](CO)[C@@H](O)[C@H]3O)c2n1
InChI Key InChIKey=RVAOXOAMYXAESW-DMEFTLKTSA-N
Data  2 KI
  Tab Delimited (TSV)   2D SDfile   Computed 3D by Vconf -m prep SDfile
Find this compound or compounds like it in BindingDB:
Activity Spreadsheet -- Enzyme Inhibition Constant Data from BindingDB
Found 2 hits for monomerid = 50119164
TargetAdenosine receptor A2a(Rattus norvegicus (rat))
Cv Therapeutics
Curated by ChEMBL
LigandPNGBDBM50119164(({1-[6-Amino-9-((2R,3R,4S,5R)-3,4-dihydroxy-5-hydr...)
Affinity DataKi:  290nM. Assay description: Receptor binding affinity for the adenosine A2A receptor was determined using [3H]-ZM-241,385 as a radioligand in rat
In DepthDetails ArticlePubMed
TargetAdenosine receptor A2a(Homo sapiens (Human))
Cv Therapeutics
Curated by ChEMBL
LigandPNGBDBM50119164(({1-[6-Amino-9-((2R,3R,4S,5R)-3,4-dihydroxy-5-hydr...)
Affinity DataKi:  980nM. Assay description: Receptor binding affinity for the adenosine A2A receptor were determined using [3H]-ZM-241,385 as a radioligand in pig
In DepthDetails ArticlePubMed