BDBM50119296 CHEMBL3613816
SMILES COC(=O)[C@@H](NC(=O)N[C@@H](C(C)C)C(=O)N[C@H]1CCCCNC(=O)\C=C\[C@H](Cc2ccccc2F)NC1=O)C(C)C
InChI Key InChIKey=CUQABLPYNDUVHK-NUAOEIINSA-N
Data  1 KI
  Tab Delimited (TSV)   2D SDfile   Computed 3D by Vconf -m prep SDfile
Find this compound or compounds like it in BindingDB:
Activity Spreadsheet -- Enzyme Inhibition Constant Data from BindingDB
Found 1 hit for monomerid = 50119296
TargetProteasome subunit beta type-5(Homo sapiens (Human))
Brown University
Curated by ChEMBL
LigandPNGBDBM50119296(CHEMBL3613816)
Affinity DataKi:  906nM. Assay description: Inhibition of human 20S proteasome beta5 subunit using Suc-LLVY-AMC as substrate by fluorescence assay
In DepthDetails ArticlePubMed