BDBM50119825 CHEMBL104972::[3-(6-Amino-purin-9-yl)-propoxy]-acetic acid ethyl ester
SMILES CCOC(=O)COCCCn1cnc2c(N)ncnc12
InChI Key InChIKey=DOWMTCFEIZVTQH-UHFFFAOYSA-N
Data  1 IC50
  Tab Delimited (TSV)   2D SDfile   Computed 3D by Vconf -m prep SDfile
Find this compound or compounds like it in BindingDB:
Activity Spreadsheet -- Enzyme Inhibition Constant Data from BindingDB
Found 1 hit for monomerid = 50119825
TargetAdenylate cyclase type 5(Homo sapiens (Human))
Millennium Pharmaceuticals
Curated by ChEMBL
LigandPNGBDBM50119825(CHEMBL104972 | [3-(6-Amino-purin-9-yl)-propoxy]-ac...)
Affinity DataIC50: >2.00E+5nM. Assay description: Inhibition of recombinant human adenylate cyclase 5 expressed in HEK293 cells
In DepthDetails ArticlePubMed