BDBM50120413 CHEMBL3617831
SMILES CSc1cccc(c1)-n1cc(nn1)-c1cccc(c1)[N+]([O-])=O
InChI Key InChIKey=OVPFPLNOPGBOJH-UHFFFAOYSA-N
Data  1 EC50
  Tab Delimited (TSV)   2D SDfile   Computed 3D by Vconf -m prep SDfile
Find this compound or compounds like it in BindingDB:
Activity Spreadsheet -- Enzyme Inhibition Constant Data from BindingDB
Found 1 hit for monomerid = 50120413
TargetNuclear factor erythroid 2-related factor 2(Homo sapiens (Human))
University College London
Curated by ChEMBL
LigandPNGBDBM50120413(CHEMBL3617831)
Affinity DataEC50:  3.85E+4nM. Assay description: Inhibition of kelch domain of Keap1 (unknown origin) interaction to high affinity ETGE motif from Nrf2 by fluorescence polarization assay
In DepthDetails ArticlePubMed