BDBM50120657 1-(2-Aza-bicyclo[2.2.2]oct-2-yl)-2-[2-(3,5-dimethyl-phenyl)-3-((S)-2-{2-[2-(1-hydroxy-ethyl)-pyridin-4-yl]-ethylamino}-1-methyl-ethyl)-1H-indol-5-yl]-2-methyl-propan-1-one::CHEMBL113432
SMILES CC(O)c1cc(CCNC[C@@H](C)c2c([nH]c3ccc(cc23)C(C)(C)C(=O)N2CC3CCC2CC3)-c2cc(C)cc(C)c2)ccn1
InChI Key InChIKey=AFYQABBRKIZIFQ-YHQYICKOSA-N
Data  2 IC50
  Tab Delimited (TSV)   2D SDfile   Computed 3D by Vconf -m prep SDfile
Find this compound or compounds like it in BindingDB:
Activity Spreadsheet -- Enzyme Inhibition Constant Data from BindingDB
Found 2 hits for monomerid = 50120657
TargetGonadotropin-releasing hormone receptor(Homo sapiens (Human))
Merck Research Laboratories
Curated by ChEMBL
LigandPNGBDBM50120657(1-(2-Aza-bicyclo[2.2.2]oct-2-yl)-2-[2-(3,5-dimethy...)
Affinity DataIC50:  20nM. Assay description: Concentration required for the inhibition of phosphatidyl inositol hydrolysis in chinese hamster ovary cells expressing human GnRH receptor (Gonadotr...
In DepthDetails ArticlePubMed
TargetGonadotropin-releasing hormone receptor(Homo sapiens (Human))
Merck Research Laboratories
Curated by ChEMBL
LigandPNGBDBM50120657(1-(2-Aza-bicyclo[2.2.2]oct-2-yl)-2-[2-(3,5-dimethy...)
Affinity DataIC50:  0.600nM. Assay description: Concentration required for the inhibition of I-125 labeled buserelin binding to the human Gonadotropin-releasing hormone receptor
In DepthDetails ArticlePubMed