BDBM50120703 3,4-Dihydro-1H-pyrrolo[4,3,2-de]isoquinolin-5-one::CHEMBL356104
SMILES O=C1NCc2c[nH]c3cccc1c23
InChI Key InChIKey=PYLXNOZFJZQGBX-UHFFFAOYSA-N
Data  1 KI
  Tab Delimited (TSV)   2D SDfile   Computed 3D by Vconf -m prep SDfile
Find this compound or compounds like it in BindingDB:
Activity Spreadsheet -- Enzyme Inhibition Constant Data from BindingDB
Found 1 hit for monomerid = 50120703
TargetPoly [ADP-ribose] polymerase 1(Homo sapiens (Human))
Pfizer
Curated by ChEMBL
LigandPNGBDBM50120703(3,4-Dihydro-1H-pyrrolo[4,3,2-de]isoquinolin-5-one ...)
Affinity DataKi:  47nM. Assay description: In vitro inhibitory activity towards human poly(ADP-ribose) polymerase 1 (PARP-1).
In DepthDetails ArticlePubMed