BDBM50120715 2-(4-Fluoro-phenyl)-3,4,5,6-tetrahydro-1H-azepino[5,4,3-cd]indole::CHEMBL357240
SMILES Fc1ccc(cc1)-c1[nH]c2cccc3CNCCc1c23
InChI Key InChIKey=ATLLOSJYMSQHDH-UHFFFAOYSA-N
Data  1 KI
  Tab Delimited (TSV)   2D SDfile   Computed 3D by Vconf -m prep SDfile
Find this compound or compounds like it in BindingDB:
Activity Spreadsheet -- Enzyme Inhibition Constant Data from BindingDB
Found 1 hit for monomerid = 50120715
TargetPoly [ADP-ribose] polymerase 1(Homo sapiens (Human))
Pfizer
Curated by ChEMBL
LigandPNGBDBM50120715(2-(4-Fluoro-phenyl)-3,4,5,6-tetrahydro-1H-azepino[...)
Affinity DataKi: >1.00E+4nM. Assay description: In vitro inhibitory activity towards human poly(ADP-ribose) polymerase 1 (PARP-1).
In DepthDetails ArticlePubMed