BDBM50120733 2-(2-Methylsulfanyl-phenyl)-1,3,4,5-tetrahydro-azepino[5,4,3-cd]indol-6-one::CHEMBL144060
SMILES CSc1ccccc1-c1[nH]c2cccc3C(=O)NCCc1c23
InChI Key InChIKey=OFJMEKODNHGXEK-UHFFFAOYSA-N
Data  1 KI
  Tab Delimited (TSV)   2D SDfile   Computed 3D by Vconf -m prep SDfile
Find this compound or compounds like it in BindingDB:
Activity Spreadsheet -- Enzyme Inhibition Constant Data from BindingDB
Found 1 hit for monomerid = 50120733
TargetPoly [ADP-ribose] polymerase 1(Homo sapiens (Human))
Pfizer
Curated by ChEMBL
LigandPNGBDBM50120733(2-(2-Methylsulfanyl-phenyl)-1,3,4,5-tetrahydro-aze...)
Affinity DataKi:  32nM. Assay description: In vitro inhibitory activity towards human poly(ADP-ribose) polymerase 1 (PARP-1).
In DepthDetails ArticlePubMed