BDBM50120782 2-(2-Fluoro-phenyl)-8-pyridin-3-ylmethyl-6,7,8,9-tetrahydro-5H-1,3a,5,8-tetraaza-cyclopenta[a]naphthalen-4-one::CHEMBL146086
SMILES Fc1ccccc1-c1cn2c(n1)c1CN(Cc3cccnc3)CCc1[nH]c2=O
InChI Key InChIKey=VKWYSXDERHIYKE-UHFFFAOYSA-N
Data  3 EC50
  Tab Delimited (TSV)   2D SDfile   Computed 3D by Vconf -m prep SDfile
Find this compound or compounds like it in BindingDB:
Activity Spreadsheet -- Enzyme Inhibition Constant Data from BindingDB
Found 3 hits for monomerid = 50120782
TargetGamma-aminobutyric acid receptor subunit alpha-3(Homo sapiens (Human))
Neurogen
Curated by ChEMBL
LigandPNGBDBM50120782(2-(2-Fluoro-phenyl)-8-pyridin-3-ylmethyl-6,7,8,9-t...)
Affinity DataEC50:  23nM. Assay description: Effective concentration against gamma-aminobutyric acid (GABA) A receptor, alpha 3
In DepthDetails ArticlePubMed
TargetGamma-aminobutyric acid receptor subunit alpha-1(Homo sapiens (Human))
Neurogen
Curated by ChEMBL
LigandPNGBDBM50120782(2-(2-Fluoro-phenyl)-8-pyridin-3-ylmethyl-6,7,8,9-t...)
Affinity DataEC50:  56nM. Assay description: Effective concentration against gamma-aminobutyric acid (GABA) A receptor, alpha 1
In DepthDetails ArticlePubMed
TargetGamma-aminobutyric acid receptor subunit alpha-2(Homo sapiens (Human))
Neurogen
Curated by ChEMBL
LigandPNGBDBM50120782(2-(2-Fluoro-phenyl)-8-pyridin-3-ylmethyl-6,7,8,9-t...)
Affinity DataEC50:  101nM. Assay description: Effective concentration against gamma-aminobutyric acid (GABA) A receptor, alpha 2
In DepthDetails ArticlePubMed