BDBM50120838 CHEMBL1233953
SMILES OC[C@H]1N\C(=N\O)[C@H](O)[C@@H](O)[C@@H]1O[C@H]1O[C@H](CO)[C@@H](O[C@H]2O[C@H](CO)[C@@H](O)[C@H](O)[C@H]2O)[C@H](O)[C@H]1O
InChI Key InChIKey=AHRWQUNEPBVNOT-IVJVVCOPSA-N
Data  1 KI
  Tab Delimited (TSV)   2D SDfile   Computed 3D by Vconf -m prep SDfile
Find this compound or compounds like it in BindingDB:
Activity Spreadsheet -- Enzyme Inhibition Constant Data from BindingDB
Found 1 hit for monomerid = 50120838
TargetPancreatic alpha-amylase(Homo sapiens (Human))
Freie Universit£T Berlin
Curated by ChEMBL
LigandPNGBDBM50120838(CHEMBL1233953)
Affinity DataKi:  1.80E+6nM. Assay description: Inhibition of human pancreatic alpha-amylase assessed as hydrolysis of G3F by Dixon plot analysis
In DepthDetails ArticlePubMed