BDBM50121034 CHEMBL332025::[1-((S)-7-Oxo-4-oxa-1-aza-bicyclo[3.2.0]hept-6-ylcarbamoyl)-2-phenyl-ethyl]-carbamic acid benzyl ester
SMILES O=C(NC(Cc1ccccc1)C(=O)NC1[C@@H]2OCCN2C1=O)OCc1ccccc1
InChI Key InChIKey=VYRSXJDNPISAMG-NGICGMGXSA-N
Data  2 IC50
  Tab Delimited (TSV)   2D SDfile   Computed 3D by Vconf -m prep SDfile
Find this compound or compounds like it in BindingDB:
Activity Spreadsheet -- Enzyme Inhibition Constant Data from BindingDB
Found 2 hits for monomerid = 50121034
TargetProcathepsin L(Rattus norvegicus)
Currently Naeja Pharmaceutical
Curated by ChEMBL
LigandPNGBDBM50121034(CHEMBL332025 | [1-((S)-7-Oxo-4-oxa-1-aza-bicyclo[3...)
Affinity DataIC50:  4.00E+3nM. Assay description: Inhibition of Cbz-Phe-Arg-AMC binding to Cathepsin L cysteine protease
In DepthDetails ArticlePubMed
TargetCathepsin K(Homo sapiens (Human))
Currently Naeja Pharmaceutical
Curated by ChEMBL
LigandPNGBDBM50121034(CHEMBL332025 | [1-((S)-7-Oxo-4-oxa-1-aza-bicyclo[3...)
Affinity DataIC50:  5nM. Assay description: Inhibition of Cbz-Phe-Arg-AMC binding to Cathepsin K cysteine protease
In DepthDetails ArticlePubMed