BDBM50121069 CHEMBL3622016
SMILES NS(=O)(=O)Oc1ccc2c3CCCCCCCCCCCCCc3c(=O)oc2c1
InChI Key InChIKey=UFBFCFVEOWFYAP-UHFFFAOYSA-N
Data  1 IC50
  Tab Delimited (TSV)   2D SDfile   Computed 3D by Vconf -m prep SDfile
Find this compound or compounds like it in BindingDB:
Activity Spreadsheet -- Enzyme Inhibition Constant Data from BindingDB
Found 1 hit for monomerid = 50121069
TargetSteryl-sulfatase(Homo sapiens (Human))
University Of Bath
Curated by ChEMBL
LigandPNGBDBM50121069(CHEMBL3622016)
Affinity DataIC50:  370nM. Assay description: Inhibition of STS activity in human placental microsome
In DepthDetails ArticlePubMed