BDBM50121307 CHEMBL3622428
SMILES COc1cccc(c1)C(=O)NCCNc1cccc(NS(=O)(=O)c2cc(ccc2OC)-c2cccc(c2)C(=O)N(C)C)c1
InChI Key InChIKey=AINDCHPKOIXBSO-UHFFFAOYSA-N
Data  2 EC50
  Tab Delimited (TSV)   2D SDfile   Computed 3D by Vconf -m prep SDfile
Find this compound or compounds like it in BindingDB:
Activity Spreadsheet -- Enzyme Inhibition Constant Data from BindingDB
Found 2 hits for monomerid = 50121307
TargetOrexin/Hypocretin receptor type 1(Homo sapiens (Human))
Kitasato University
Curated by ChEMBL
LigandPNGBDBM50121307(CHEMBL3622428)
Affinity DataEC50:  9.25E+3nM. Assay description: Agonist activity at human OX1R expressed in CHOK1 cells by calcium mobilization assay
In DepthDetails ArticlePubMed
TargetOrexin receptor type 2(Homo sapiens (Human))
Kitasato University
Curated by ChEMBL
LigandPNGBDBM50121307(CHEMBL3622428)
Affinity DataEC50:  33nM. Assay description: Agonist activity at human OX2R expressed in CHOK1 cells by NFAT-response luciferase reporter gene assay
In DepthDetails ArticlePubMed