BDBM50121567 CHEMBL357816::Morpholine-4-carboxylic acid [1-(1-cyano-3-phenyl-propylcarbamoyl)-2-methyl-propyl]-amide
SMILES CC(C)[C@H](NC(=O)N1CCOCC1)C(=O)N[C@@H](CCc1ccccc1)C#N
InChI Key InChIKey=KLNHRDVDAQJAGQ-ROUUACIJSA-N
Data  1 IC50
  Tab Delimited (TSV)   2D SDfile   Computed 3D by Vconf -m prep SDfile
Find this compound or compounds like it in BindingDB:
Activity Spreadsheet -- Enzyme Inhibition Constant Data from BindingDB
Found 1 hit for monomerid = 50121567
TargetCathepsin S(Homo sapiens (Human))
Boehringer Ingelheim Pharmaceuticals
Curated by ChEMBL
LigandPNGBDBM50121567(CHEMBL357816 | Morpholine-4-carboxylic acid [1-(1-...)
Affinity DataIC50:  6.00E+3nM. Assay description: Inhibitory concentration against human recombinant Cathepsin S expressed in baculovirus
In DepthDetails ArticlePubMed