BDBM50121573 CHEMBL358829::Morpholine-4-carboxylic acid [1-(1-cyano-3-phenyl-propylcarbamoyl)-4-methyl-pentyl]-amide
SMILES CC(C)CC[C@H](NC(=O)N1CCOCC1)C(=O)N[C@H](CCc1ccccc1)C#N
InChI Key InChIKey=AUKJFHMAFFUJSG-UXHICEINSA-N
Data  1 IC50  1 Kd
  Tab Delimited (TSV)   2D SDfile   Computed 3D by Vconf -m prep SDfile
Find this compound or compounds like it in BindingDB:
Activity Spreadsheet -- Enzyme Inhibition Constant Data from BindingDB
Found 2 hits for monomerid = 50121573
TargetCathepsin S(Homo sapiens (Human))
Boehringer Ingelheim Pharmaceuticals
Curated by ChEMBL
LigandPNGBDBM50121573(CHEMBL358829 | Morpholine-4-carboxylic acid [1-(1-...)
Affinity DataKd:  28nM. Assay description: Equilibrium dissocation constant determined using fluorescence based competitive binding assay towards Cathepsin S
In DepthDetails ArticlePubMed
TargetCathepsin S(Homo sapiens (Human))
Boehringer Ingelheim Pharmaceuticals
Curated by ChEMBL
LigandPNGBDBM50121573(CHEMBL358829 | Morpholine-4-carboxylic acid [1-(1-...)
Affinity DataIC50:  387nM. Assay description: Inhibitory concentration against human recombinant Cathepsin S expressed in baculovirus
In DepthDetails ArticlePubMed