BDBM50121668 2-[10-((1S,2R)-2-Hexyl-cyclopropyl)-dec-9-ynyloxy]-propane-1,3-diol::CHEMBL141133
SMILES CCCCCC[C@@H]1C[C@@H]1C#CCCCCCCCCOC(CO)CO
InChI Key InChIKey=LTZXRJRLNIAMFU-RTWAWAEBSA-N
Data  1 KI
  Tab Delimited (TSV)   2D SDfile   Computed 3D by Vconf -m prep SDfile
Find this compound or compounds like it in BindingDB:
Activity Spreadsheet -- Enzyme Inhibition Constant Data from BindingDB
Found 1 hit for monomerid = 50121668
TargetCannabinoid receptor 1(Rattus norvegicus (rat))
Discaff
Curated by ChEMBL
LigandPNGBDBM50121668(2-[10-((1S,2R)-2-Hexyl-cyclopropyl)-dec-9-ynyloxy]...)
Affinity DataKi: >5.00E+4nM. Assay description: Binding affinity towards cannabinoid CB1 receptor in rat brain membrane by displacement of [3H]-SR-141,716A
In DepthDetails ArticlePubMed