BDBM50121712 ANTAQ::CHEMBL169736
SMILES O=c1[nH]c2ccccc2c(=O)n1-c1c2ccccc2cc2ccccc12
InChI Key InChIKey=SISSLRJYACXIQF-UHFFFAOYSA-N
Data  1 IC50
  Tab Delimited (TSV)   2D SDfile   Computed 3D by Vconf -m prep SDfile
Find this compound or compounds like it in BindingDB:
Activity Spreadsheet -- Enzyme Inhibition Constant Data from BindingDB
Found 1 hit for monomerid = 50121712
TargetPuromycin-sensitive aminopeptidase(Homo sapiens (Human))
The University Of Tokyo
Curated by ChEMBL
LigandPNGBDBM50121712(ANTAQ | CHEMBL169736)
Affinity DataIC50:  2.90E+3nM. Assay description: Puromycin sensitive aminopeptidase inhibitory activity of the compound was determined by the use of L-Ala AMC with MOLT-4
In DepthDetails ArticlePubMed