BDBM50121849 CHEMBL3617175
SMILES COc1cc2CCN(Cc2cc1OC1CCCC1)C(=O)c1ccccc1
InChI Key InChIKey=DFKOUZPGEZPWIR-UHFFFAOYSA-N
Data  1 IC50
  Tab Delimited (TSV)   2D SDfile   Computed 3D by Vconf -m prep SDfile
Find this compound or compounds like it in BindingDB:
Activity Spreadsheet -- Enzyme Inhibition Constant Data from BindingDB
Found 1 hit for monomerid = 50121849
TargetcAMP-specific 3',5'-cyclic phosphodiesterase 4B(Homo sapiens (Human))
South China Agricultural University
Curated by ChEMBL
LigandPNGBDBM50121849(CHEMBL3617175)
Affinity DataIC50:  2.35E+4nM. Assay description: Inhibition of PDE4B isolated from human U937 cells using [3H]-cAMP as substrate after 30 mins
In DepthDetails ArticlePubMed