BDBM50121881 CHEMBL3617284
SMILES Oc1c(nc([nH]c1=O)-c1cccs1)C(=O)Nc1cccnc1
InChI Key InChIKey=FNXLGHXWYRMSSR-UHFFFAOYSA-N
Data  2 IC50
  Tab Delimited (TSV)   2D SDfile   Computed 3D by Vconf -m prep SDfile
Find this compound or compounds like it in BindingDB:
Activity Spreadsheet -- Enzyme Inhibition Constant Data from BindingDB
Found 2 hits for monomerid = 50121881
TargetDeoxyribonuclease-1(Homo sapiens (Human))
Mrc Technology
Curated by ChEMBL
LigandPNGBDBM50121881(CHEMBL3617284)
Affinity DataIC50: >1.00E+5nM. Assay description: Inhibition of DNAse1 (unknown origin)
In DepthDetails ArticlePubMed
TargetFlap endonuclease 1(Homo sapiens (Human))
Mrc Technology
Curated by ChEMBL
LigandPNGBDBM50121881(CHEMBL3617284)
Affinity DataIC50:  8.60E+3nM. Assay description: Inhibition of FEN1 (unknown origin)
In DepthDetails ArticlePubMed