BDBM50121998 CHEMBL3322866
SMILES Nc1cc(ccn1)C(O)=O
InChI Key InChIKey=QMKZZQPPJRWDED-UHFFFAOYSA-N
Data  2 IC50
  Tab Delimited (TSV)   2D SDfile   Computed 3D by Vconf -m prep SDfile
Find this compound or compounds like it in BindingDB:
Activity Spreadsheet -- Enzyme Inhibition Constant Data from BindingDB
Found 2 hits for monomerid = 50121998
TargetD-aspartate oxidase(Homo sapiens (Human))
Kitasato University
Curated by ChEMBL
LigandPNGBDBM50121998(CHEMBL3322866)
Affinity DataIC50: >1.00E+5nM. Assay description: Inhibition of human recombinant DDO expressed in Escherichia coli BL21(DE3) using D-Asp and D-Ala assessed as 2-oxo acid production after 10 mins by ...
In DepthDetails ArticlePubMed
TargetD-amino-acid oxidase(Homo sapiens (Human))
Kitasato University
Curated by ChEMBL
LigandPNGBDBM50121998(CHEMBL3322866)
Affinity DataIC50: >1.00E+5nM. Assay description: Inhibition of human recombinant DAO expressed in Escherichia coli BL21(DE3) using D-Asp and D-Ala assessed as 2-oxo acid production after 10 mins by ...
In DepthDetails ArticlePubMed