BDBM50122018 CHEMBL1529836
SMILES CN(C)c1cncc(c1)C(O)=O
InChI Key InChIKey=BZUPYORMYVQEMK-UHFFFAOYSA-N
Data  1 IC50
  Tab Delimited (TSV)   2D SDfile   Computed 3D by Vconf -m prep SDfile
Find this compound or compounds like it in BindingDB:
Activity Spreadsheet -- Enzyme Inhibition Constant Data from BindingDB
Found 1 hit for monomerid = 50122018
TargetD-aspartate oxidase(Homo sapiens (Human))
Kitasato University
Curated by ChEMBL
LigandPNGBDBM50122018(CHEMBL1529836)
Affinity DataIC50: >1.00E+6nM. Assay description: Inhibition of human recombinant DDO expressed in Escherichia coli BL21(DE3) using D-Asp and D-Ala assessed as 2-oxo acid production after 10 mins by ...
In DepthDetails ArticlePubMed