BDBM50122183 CHEMBL431524::N-(5-Chloro-2-ethylcarbamoylmethoxy-benzyl)-2-(6-methyl-2-oxo-3-phenethylamino-2H-pyrazin-1-yl)-acetamide
SMILES CCNC(=O)COc1ccc(Cl)cc1CNC(=O)Cn1c(C)cnc(NCCc2ccccc2)c1=O
InChI Key InChIKey=VQXMYKHZVHNFTJ-UHFFFAOYSA-N
Data  2 KI
  Tab Delimited (TSV)   2D SDfile   Computed 3D by Vconf -m prep SDfile
Find this compound or compounds like it in BindingDB:
Activity Spreadsheet -- Enzyme Inhibition Constant Data from BindingDB
Found 2 hits for monomerid = 50122183
TargetProthrombin(Homo sapiens (Human))
Merck Research Laboratories
Curated by ChEMBL
LigandPNGBDBM50122183(CHEMBL431524 | N-(5-Chloro-2-ethylcarbamoylmethoxy...)
Affinity DataKi:  0.0700nM. Assay description: Inhibition of thrombin in human plasma
In DepthDetails ArticlePubMed
TargetTrypsin(Homo sapiens (Human))
Merck Research Laboratories
Curated by ChEMBL
LigandPNGBDBM50122183(CHEMBL431524 | N-(5-Chloro-2-ethylcarbamoylmethoxy...)
Affinity DataKi:  1.00E+3nM. Assay description: Inhibition of trypsin in human plasma
In DepthDetails ArticlePubMed