BDBM50122335 (S)-2-Ethoxy-3-{4-[(E)-3-(4-fluoro-phenyl)-3-phenyl-allyloxy]-phenyl}-propionic acid::CHEMBL327481
SMILES CCO[C@@H](Cc1ccc(OC\C=C(/c2ccccc2)c2ccc(F)cc2)cc1)C(O)=O
InChI Key InChIKey=SNMFWHCQPZSLEZ-WWNGRIQCSA-N
Data  7 EC50
  Tab Delimited (TSV)   2D SDfile   Computed 3D by Vconf -m prep SDfile
Find this compound or compounds like it in BindingDB:
Activity Spreadsheet -- Enzyme Inhibition Constant Data from BindingDB
Found 7 hits for monomerid = 50122335
LigandPNGBDBM50122335((S)-2-Ethoxy-3-{4-[(E)-3-(4-fluoro-phenyl)-3-pheny...)
Affinity DataEC50:  5.30E+3nM. Assay description: Transactivation of GAL4-fused Homo sapiens (human) PPARalpha DNA binding domain expressed in African green monkey CV1 cells by luciferase reporter ge...
In DepthDetails Article
LigandPNGBDBM50122335((S)-2-Ethoxy-3-{4-[(E)-3-(4-fluoro-phenyl)-3-pheny...)
Affinity DataEC50:  8.50E+3nM. Assay description: Transactivation of GAL4-fused Homo sapiens (human) PPARgamma DNA binding domain expressed in African green monkey CV1 cells by luciferase reporter ge...
In DepthDetails Article
LigandPNGBDBM50122335((S)-2-Ethoxy-3-{4-[(E)-3-(4-fluoro-phenyl)-3-pheny...)
Affinity DataEC50:  5.30E+3nM. Assay description: Transactivation of GAL4-fused Homo sapiens (human) PPARalpha DNA binding domain expressed in African green monkey CV1 cells by luciferase reporter ge...
In DepthDetails Article
TargetPeroxisome proliferator-activated receptor delta(Homo sapiens (Human))
Novo Nordisk
Curated by ChEMBL
LigandPNGBDBM50122335((S)-2-Ethoxy-3-{4-[(E)-3-(4-fluoro-phenyl)-3-pheny...)
Affinity DataEC50:  8.30E+3nM. Assay description: In vitro activation of human peroxisome proliferator activated receptor delta (PPAR delta)
In DepthDetails ArticlePubMed
LigandPNGBDBM50122335((S)-2-Ethoxy-3-{4-[(E)-3-(4-fluoro-phenyl)-3-pheny...)
Affinity DataEC50:  8.50E+3nM. Assay description: In vitro activation of human peroxisome proliferator activated receptor gamma (PPAR gamma)
In DepthDetails ArticlePubMed
LigandPNGBDBM50122335((S)-2-Ethoxy-3-{4-[(E)-3-(4-fluoro-phenyl)-3-pheny...)
Affinity DataEC50:  5.30E+3nM. Assay description: In vitro activation of human peroxisome proliferator activated receptor alpha
In DepthDetails ArticlePubMed
LigandPNGBDBM50122335((S)-2-Ethoxy-3-{4-[(E)-3-(4-fluoro-phenyl)-3-pheny...)
Affinity DataEC50:  8.50E+3nM. Assay description: Transactivation of GAL4-fused Homo sapiens (human) PPARgamma DNA binding domain expressed in African green monkey CV1 cells by luciferase reporter ge...
In DepthDetails Article